ell 0.40 test failure (Ryzen-specific?)

OpenSubmitted by Maxim Cournoyer.
Details
2 participants
  • Efraim Flashner
  • Maxim Cournoyer
Owner
unassigned
Severity
normal
M
M
Maxim Cournoyer wrote on 19 May 05:11 +0200
ell 0.40 test failure
(name . bug-guix)(address . bug-guix@gnu.org)
87o8d7mn8p.fsf@gmail.com
Hello,
Upon trying to reconfigure my system with master, I got the followingtest failure for the recently updated ell package:
Toggle snippet (58 lines)PASS: unit/test-gvariant-utilPASS: unit/test-dbus-message./build-aux/test-driver: line 107: 15217 Aborted "$@" > $log_file 2>&1FAIL: unit/test-cipherPASS: unit/test-dbusPASS: unit/test-dbus-message-fdsPASS: unit/test-dbus-propertiesPASS: unit/test-dbus-servicePASS: unit/test-mainPASS: unit/test-pbkdf2============================================================================Testsuite summary for ell 0.40============================================================================# TOTAL: 40# PASS: 39# SKIP: 0# XFAIL: 0# FAIL: 1# XPASS: 0# ERROR: 0============================================================================See ./test-suite.log============================================================================make[3]: *** [Makefile:2099: test-suite.log] Error 1make[2]: *** [Makefile:2207: check-TESTS] Error 2make[1]: *** [Makefile:2713: check-am] Error 2make: *** [Makefile:2715: check] Error 2
Test suite failed, dumping logs.
--- ./test-suite.log --------------------------------------------------------
================================ ell 0.40: ./test-suite.log================================
# TOTAL: 40# PASS: 39# SKIP: 0# XFAIL: 0# FAIL: 1# XPASS: 0# ERROR: 0
.. contents:: :depth: 2
FAIL: unit/test-cipher======================
test-cipher: unit/test-cipher.c:93: test_aes_ctr: Assertion `l_cipher_encrypt(cipher, buf, buf, FIXED_LEN)' failed.FAIL unit/test-cipher (exit status: 134)

command "make" "check" "-j" "24" failed with status 2builder for `/gnu/store/zz6sia4wwcg0885fi696kmiak0abiwy6-ell-0.40.drv' failed with exit code 1@ build-failed /gnu/store/zz6sia4wwcg0885fi696kmiak0abiwy6-ell-0.40.drv - 1 builder for `/gnu/store/zz6sia4wwcg0885fi696kmiak0abiwy6-ell-0.40.drv' failed with exit code 1
Maxim
E
E
Efraim Flashner wrote on 19 May 21:38 +0200
(name . Maxim Cournoyer)(address . maxim.cournoyer@gmail.com)(address . 48515@debbugs.gnu.org)
YKVpGamFhoaKajA5@3900XT
I was able to reproduce the test suite failure, but with a differenttest. I was using my 3900XT, also 24 cores
PASS: unit/test-timePASS: unit/test-dir-watchPASS: unit/test-pathPASS: unit/test-dbus-watchPASS: unit/test-gvariant-messagePASS: unit/test-dbus./build-aux/test-driver: line 107: 17030 Aborted "$@" > $log_file 2>&1FAIL: unit/test-dbus-propertiesPASS: unit/test-dbus-message-fdsPASS: unit/test-dbus-servicePASS: unit/test-mainPASS: unit/test-pbkdf2============================================================================Testsuite summary for ell 0.40============================================================================# TOTAL: 40# PASS: 39# SKIP: 0# XFAIL: 0# FAIL: 1# XPASS: 0# ERROR: 0============================================================================See ./test-suite.log============================================================================make[3]: *** [Makefile:2099: test-suite.log] Error 1make[2]: *** [Makefile:2207: check-TESTS] Error 2make[1]: *** [Makefile:2713: check-am] Error 2make: *** [Makefile:2715: check] Error 2
Test suite failed, dumping logs.
--- ./test-suite.log --------------------------------------------------------
================================ ell 0.40: ./test-suite.log================================
# TOTAL: 40# PASS: 39# SKIP: 0# XFAIL: 0# FAIL: 1# XPASS: 0# ERROR: 0
.. contents:: :depth: 2
FAIL: unit/test-dbus-properties===============================
launching dbus-daemondbus-daemon process 17031 createdreadyrequest name result=failedTEST: Legacy properties getTEST FAILED in get_properties_callback at unit/test-dbus-properties.c:340: !l_dbus_message_get_error(message, ((void *)0), ((void *)0))Disconnected from DBusFAIL unit/test-dbus-properties (exit status: 134)

command "make" "check" "-j" "24" failed with status 2builder for `/gnu/store/1vjr3z3mghf77wvwj0mb5f4nwzmd4c7i-ell-0.40.drv' failed with exit code 1build of /gnu/store/1vjr3z3mghf77wvwj0mb5f4nwzmd4c7i-ell-0.40.drv failedView build log at '/var/log/guix/drvs/1v/jr3z3mghf77wvwj0mb5f4nwzmd4c7i-ell-0.40.drv.bz2'.guix build: error: build of `/gnu/store/1vjr3z3mghf77wvwj0mb5f4nwzmd4c7i-ell-0.40.drv' failed


-- Efraim Flashner <efraim@flashner.co.il> אפרים פלשנרGPG key = A28B F40C 3E55 1372 662D 14F7 41AA E7DC CA3D 8351Confidentiality cannot be guaranteed on emails sent or received unencrypted
-----BEGIN PGP SIGNATURE-----
iQIzBAABCgAdFiEEoov0DD5VE3JmLRT3Qarn3Mo9g1EFAmClaRkACgkQQarn3Mo9g1G+ShAAoRUuW1yDZcAMkd3rWQ5VrgZnc3z2SCaHxOBy/AkjsdvjoL8JOpyd2kg1xLVnbN6p/jv7nF8/UlHtflJbtLm6R5Y2nOE0az0jfVE3c1aBidj5UqT2nSxCG++kUBmnajIoTnEekb32JJpzB5IZhmwL0KAfkq3Y3mlepn3JLr5EMCe60vYGvSv8hdByglonYmKAOIkj7cn+i9qN1cEAo5SQ/U+hFd53Mttsdjv9Ps6KJPjbrrHWPubNo8oQdPmXkDnySnKcXjhCx9XTobBJdbm7eUX0wW0wB2C1/8NDAqYz3OSiR8cdCdqpfbN+2/5cMWZcDaQg1RBSyunLBFcJ/v6/jgSmMGzST5ccoaaQgjuDQ69Jn4JdWZ1VSAOKjdlA6zxgRcU4mNb+UOeWr6agu73fJCKkBeJF73Xslms1EW024SbXXRIHjOLnWqPiFntPr3o8vw3aqiMttLH8Y+UwSrj6NRfdzl6mMT0YcNrT7LjDrpCxZ9VNoCi3Ylrte7+aoOQ2dm2ENp2mMxjnoAxEqJddW9E/7/euNBboN0K5S6OLB89z4CFVOKkYRsjXHYN3FvWhzxKt4DkBxYb4SU7An8Lq8IUx80/OI3+BkeEdPTrbjfBiPIzJ/9KITT0OTqPGf9GQBRtzcRA2gb/8E01MvqQRZfvWJ7rKAZiz5K+EZfISNHo==mVEd-----END PGP SIGNATURE-----

M
M
Maxim Cournoyer wrote on 20 May 14:15 +0200
(address . 48515@debbugs.gnu.org)
87lf891tzr.fsf@gmail.com
To clarify, this only happens on a machine with a Ryzen 3900X CPU thathas 24 cores. I cannot reproduce on an older Q6700 4 cores machine.Efraim was also able to reproduce on a similar Ryzen 3900XT CPU.
I tried reproducing on berlin but wasn't able to.
M
M
Maxim Cournoyer wrote on 20 May 14:16 +0200
control message for bug #48515
(address . control@debbugs.gnu.org)
87k0nt1tys.fsf@gmail.com
retitle 48515 ell 0.40 test failure (Ryzen-specific?)quit
?
Your comment

Commenting via the web interface is currently disabled.

To comment on this conversation send email to 48515@debbugs.gnu.org