spacefm fails to build

DoneSubmitted by Bradley Haggerty.
Details
2 participants
  • Bradley Haggerty
  • Efraim Flashner
Owner
unassigned
Severity
normal
B
B
Bradley Haggerty wrote on 7 Dec 2018 18:13
(address . bug-guix@gnu.org)
CABGw91fa-ygGf21t=Bj0k4Hcvv2aG68mggOmMPBTmfxtvJ-79g@mail.gmail.com
guix (GNU Guix) 5118e26f83cc2b4ec835df56bee2a4003c1325b9
building /gnu/store/k993nvk595hqsrcfj4ymvmcj3w9fbfv3-spacefm-1.0.6.drv...
builder for `/gnu/store/k993nvk595hqsrcfj4ymvmcj3w9fbfv3-spacefm-1.0.6.drv'
failed with exit code
1
build of /gnu/store/k993nvk595hqsrcfj4ymvmcj3w9fbfv3-spacefm-1.0.6.drv
failed
View build log at
'/var/log/guix/drvs/k9/93nvk595hqsrcfj4ymvmcj3w9fbfv3-spacefm-1.0.6.drv.bz2'.

guix package: error: build failed: build of
`/gnu/store/k993nvk595hqsrcfj4ymvmcj3w9fbfv3-spacefm-1.0.6.drv'
failed

from build log:
main.c:189:42: error: implicit declaration of function ‘major’
[-Werror=implicit-function-declaration]
major( stat_buf.st_dev ),
^
main.c:190:42: error: implicit declaration of function ‘minor’
[-Werror=implicit-function-declaration]
minor( stat_buf.st_dev ),
^
/gnu/store/gfprsx2m62cvqbh7ysc9ay9slhijvmal-module-import/guix/build/utils.scm:616:6:
In procedure invoke:
Throw to key `srfi-34' with args `(#<condition &invoke-error [program:
"make" arguments: ("-j" "4") exit-status: 2 term-signal: #f stop-signal:
#f] 491fc0>)'.
Attachment: file
E
E
Efraim Flashner wrote on 4 Mar 2019 21:13
(name . Bradley Haggerty)(address . bradigger@gmail.com)(address . 33666-done@debbugs.gnu.org)
20190304201356.GC5771@macbook41
On Fri, Dec 07, 2018 at 05:13:48PM +0000, Bradley Haggerty wrote:
Toggle quote (29 lines)
> guix (GNU Guix) 5118e26f83cc2b4ec835df56bee2a4003c1325b9
> building /gnu/store/k993nvk595hqsrcfj4ymvmcj3w9fbfv3-spacefm-1.0.6.drv...
> builder for `/gnu/store/k993nvk595hqsrcfj4ymvmcj3w9fbfv3-spacefm-1.0.6.drv'
> failed with exit code
> 1
> build of /gnu/store/k993nvk595hqsrcfj4ymvmcj3w9fbfv3-spacefm-1.0.6.drv
> failed
> View build log at
> '/var/log/guix/drvs/k9/93nvk595hqsrcfj4ymvmcj3w9fbfv3-spacefm-1.0.6.drv.bz2'.
>
> guix package: error: build failed: build of
> `/gnu/store/k993nvk595hqsrcfj4ymvmcj3w9fbfv3-spacefm-1.0.6.drv'
> failed
>
> from build log:
> main.c:189:42: error: implicit declaration of function ‘major’
> [-Werror=implicit-function-declaration]
> major( stat_buf.st_dev ),
> ^
> main.c:190:42: error: implicit declaration of function ‘minor’
> [-Werror=implicit-function-declaration]
> minor( stat_buf.st_dev ),
> ^
> /gnu/store/gfprsx2m62cvqbh7ysc9ay9slhijvmal-module-import/guix/build/utils.scm:616:6:
> In procedure invoke:
> Throw to key `srfi-34' with args `(#<condition &invoke-error [program:
> "make" arguments: ("-j" "4") exit-status: 2 term-signal: #f stop-signal:
> #f] 491fc0>)'.

This package seems to be building fine now, so I'm closing the bug

--
Efraim Flashner <efraim@flashner.co.il> אפרים פלשנר
GPG key = A28B F40C 3E55 1372 662D 14F7 41AA E7DC CA3D 8351
Confidentiality cannot be guaranteed on emails sent or received unencrypted
-----BEGIN PGP SIGNATURE-----

iQIzBAABCgAdFiEEoov0DD5VE3JmLRT3Qarn3Mo9g1EFAlx9hwEACgkQQarn3Mo9
g1Gzpg//ZFlGSpSt7WvAMl2q7TdQOg88/c9o2Ou398w4mfAfi5mGQEuUWUID75Aa
flUUL6sIP5bvQz8jcJ+haFLEbwDltVuUjdRItqBDkmqpfVpnfDUbwXzIClw69xbC
9obCd7hwn7pr0V7hUAJJnJUJIVEWhY/HAFqdUtHM49AY9wJilM3F6xcFf0ODpoT9
eRKuE7+r7jHwr0yGpRXhdT3bI/OSd+y6WzOyem6DGwgJciDdgKUYT71ix7hNijm6
WsqxYygc+DirB3hllGuBv3mESBYqxk1Aizkrhod6PYgCoTTNt5ZsPlZmcqWuGsf/
DVvBRfiN3oCeIBInWWCiSahaYa97xBeivplY2U+0DjAaoNX6R+606lj2R7VLdeSV
PY58tQiZ3U+qwHa6nP2cjUl9badeBvvUKNnd4VE9QbeJZbrls4kUO6Zb/GwGxaCG
r+NpBbR1kNQbaviWmufxBfttKsDeL4rHnVCKu9mlMs4Jz/JqTAZx+QArDWu5nF3z
r/eGotkUmUMkxCy4x7HqKDzL8qKIuH8oXi4JgSLeACKnczWBR0gmHjJjzPNmG5ET
QMVMvkDP4pN0iKsvBYHUUithgL8i75hsWOUQcXuHcRK+kbV8tq+KEnJDB4y1y/Nf
K48LYRzX4U/0EXwTT7A1RCiIcfX8KV+EkQLkME6yoUo9A7NPoR4=
=etz8
-----END PGP SIGNATURE-----


Closed
?
Your comment

This issue is archived.

To comment on this conversation send email to 33666@debbugs.gnu.org