bug: failed to compute derivation (possible duplicate)

DoneSubmitted by Platoxia.
Details
2 participants
  • Ludovic Courtès
  • Platoxia
Owner
unassigned
Severity
normal
P
P
Platoxia wrote on 15 Mar 2019 18:02
(name . bug-guix@gnu.org)(address . bug-guix@gnu.org)
1qyM3AaovAQpBhlYlpDI_YBPwbjmf1XWokMQVDtcWG5Z8WjdREstpfEO72aNaZ5na3McPao614a8viwi6QpvttSG7HubsAOp0Ta6l8GXWLg=@protonmail.com
NOTE: possible duplicate of bug #34061
The relevant bit follows:
- abort testsWarning: dict server unexpectedly aliveWarning: smb server unexpectedly aliveTESTDONE: 866 tests out of 867 reported OK: 99%TESTFAIL: These test cases failed: 1456TESTDONE: 1079 tests were considered during 309 seconds.TESTINFO: 212 tests were skipped due to these restraints:TESTINFO: "curl lacks sftp support" 1 times (632)TESTINFO: "curl has threaded-resolver support" 1 times (506)TESTINFO: "curl lacks TrackMemory support" 2 times (96, 558)TESTINFO: "curl has ipv6 support" 1 times (1454)TESTINFO: "curl lacks brotli support" 3 times (314, 315, 316)TESTINFO: "Resolving IPv6 'ip6-localhost' didn't work" 2 times (241, 1083)TESTINFO: "curl lacks unittest support" 16 times (1300, 1301, 1302, 1303, 1304, 1305, 1306, 1308, 1309 and 7 more)TESTINFO: "curl lacks PSL support" 1 times (1136)TESTINFO: "no stunnel" 26 times (300, 301, 302, 303, 304, 305, 306, 309, 310 and 17 more)TESTINFO: "configured as DISABLED" 18 times (530, 536, 584, 594, 836, 882, 938, 1209, 1211 and 9 more)TESTINFO: "curl lacks scp server support" 11 times (601, 603, 605, 607, 617, 619, 621, 623, 629 and 2 more)TESTINFO: "curl lacks debug support" 79 times (67, 68, 69, 81, 89, 90, 91, 150, 155 and 70 more)TESTINFO: "curl lacks sftp server support" 35 times (582, 583, 600, 602, 604, 606, 608, 609, 610 and 26 more)TESTINFO: "failed starting SSH server" 14 times (564, 700, 701, 702, 703, 706, 707, 708, 709 and 5 more)TESTINFO: "curl lacks OpenSSL support" 2 times (307, 308)@ build-log 6275 39make: *** [Makefile:796: test] Error 1@ build-log 6275 78make: Leaving directory '/tmp/guix-build-curl-7.63.0.drv-0/curl-7.63.0/tests'@ build-log 6275 11Backtrace:@ build-log 6275 74 4 (primitive-load "/gnu/store/bxg520argpj2lnwwgad35507r0n?")@ build-log 6275 19In ice-9/eval.scm:@ build-log 6275 19 191:35 3 (_ _)@ build-log 6275 20In srfi/srfi-1.scm:@ build-log 6275 77 863:16 2 (every1 #<procedure 818820 at /gnu/store/gfprsx2m62cvq?> ?)@ build-log 6275 94In /gnu/store/gfprsx2m62cvqbh7ysc9ay9slhijvmal-module-import/guix/build/gnu-build-system.scm:@ build-log 6275 19 799:28 1 (_ _)@ build-log 6275 83In /gnu/store/gfprsx2m62cvqbh7ysc9ay9slhijvmal-module-import/guix/build/utils.scm:@ build-log 6275 28 616:6 0 (invoke _ . _)@ build-log 6275 1
@ build-log 6275 107/gnu/store/gfprsx2m62cvqbh7ysc9ay9slhijvmal-module-import/guix/build/utils.scm:616:6: In procedure invoke:@ build-log 6275 170Throw to key `srfi-34' with args `(#<condition &invoke-error [program: "make" arguments: ("-C" "tests" "test") exit-status: 2 term-signal: #f stop-signal: #f] 491dc0>)'.builder for `/gnu/store/k5h4iz2hm48rc145x5fy49dnh3230iac-curl-7.63.0.drv' failed with exit code 1@ build-failed /gnu/store/k5h4iz2hm48rc145x5fy49dnh3230iac-curl-7.63.0.drv - 1 builder for `/gnu/store/k5h4iz2hm48rc145x5fy49dnh3230iac-curl-7.63.0.drv' failed with exit code 1cannot build derivation `/gnu/store/13v1z6zyn412m2r3lb1n61xx4jjhag31-git-minimal-2.21.0.drv': 1 dependencies couldn't be builtBacktrace:In ./guix/gexp.scm: 573:13 19 (_ _)In ./guix/store.scm: 1610:8 18 (_ _) 1610:8 17 (_ _)In ./guix/gexp.scm: 703:2 16 (_ _)In ./guix/monads.scm: 482:9 15 (_ _)In ./guix/gexp.scm: 573:13 14 (_ _)In ./guix/store.scm: 1610:8 13 (_ _)In ./guix/gexp.scm: 703:2 12 (_ _)In ./guix/monads.scm: 482:9 11 (_ _)In ./guix/gexp.scm: 573:13 10 (_ _)In ./guix/store.scm: 1610:8 9 (_ _)In ./guix/gexp.scm: 703:2 8 (_ _)In ./guix/monads.scm: 482:9 7 (_ _)In ./guix/gexp.scm: 573:13 6 (_ _)In ./guix/store.scm: 1610:8 5 (_ _) 1633:38 4 (_ #<store-connection 256.99 91b70f0>)In ./guix/packages.scm: 896:16 3 (cache! #<weak-table 405/883> #<package guile-gcrypt@0?> ?) 1218:22 2 (thunk) 1151:25 1 (bag->derivation #<store-connection 256.99 91b70f0> #<?> ?)In srfi/srfi-1.scm: 592:17 0 (map1 (("source" #<origin #<<git-reference> url: "?>) ?))
srfi/srfi-1.scm:592:17: In procedure map1:Throw to key `srfi-34' with args `(#<condition &store-protocol-error [message: "build of `/gnu/store/13v1z6zyn412m2r3lb1n61xx4jjhag31-git-minimal-2.21.0.drv' failed" status: 100] 6f0a5d0>)'.guix pull: error: You found a bug: the program '/gnu/store/qhxsq8wk7nysfys9a3n8jbcz838yx1aa-compute-guix-derivation'failed to compute the derivation for Guix (version: "ce32ce70475254bd5686f8ca77048127037bc87d"; system: "x86_64-linux";host version: "14bba460abe1704ef7c02fb144c047ca0c8b821f"; pull-version: 1).Please report it by email to <bug-guix@gnu.org>.
Attachment: file
L
L
Ludovic Courtès wrote on 18 Mar 2019 10:47
(name . Platoxia)(address . platoxia@protonmail.com)(address . 34871@debbugs.gnu.org)
87mulspl9f.fsf@gnu.org
Hi Platoxia,
Platoxia <platoxia@protonmail.com> skribis:
Toggle quote (4 lines)> Throw to key `srfi-34' with args `(#<condition &invoke-error [program: "make" arguments: ("-C" "tests" "test") exit-status: 2 term-signal: #f stop-signal: #f] 491dc0>)'.> builder for `/gnu/store/k5h4iz2hm48rc145x5fy49dnh3230iac-curl-7.63.0.drv' failed with exit code 1> @ build-failed /gnu/store/k5h4iz2hm48rc145x5fy49dnh3230iac-curl-7.63.0.drv - 1 builder for `/gnu/store/k5h4iz2hm48
[...]
Toggle quote (6 lines)> Throw to key `srfi-34' with args `(#<condition &store-protocol-error [message: "build of `/gnu/store/13v1z6zyn412m2r3lb1n61xx4jjhag31-git-minimal-2.21.0.drv' failed" status: 100] 6f0a5d0>)'.> guix pull: error: You found a bug: the program '/gnu/store/qhxsq8wk7nysfys9a3n8jbcz838yx1aa-compute-guix-derivation'> failed to compute the derivation for Guix (version: "ce32ce70475254bd5686f8ca77048127037bc87d"; system: "x86_64-linux";> host version: "14bba460abe1704ef7c02fb144c047ca0c8b821f"; pull-version: 1).> Please report it by email to <bug-guix@gnu.org>.
An indirect dependency of Guix, cURL in this case, failed to build.
The binary for this cURL is available on ci.guix.info, though.
Did you enable substitutes from https://ci.guix.info? Seehttps://www.gnu.org/software/guix/manual/en/html_node/Substitute-Server-Authorization.htmland related pages.
Thanks,Ludo’.
L
L
Ludovic Courtès wrote on 26 Mar 2019 11:12
control message for bug #34871
(address . control@debbugs.gnu.org)
87bm1yhrkn.fsf@gnu.org
tags 34871 unreproducibleclose 34871
?
Your comment

This issue is archived.

To comment on this conversation send email to 34871@debbugs.gnu.org